Reaction Details
TargetAurora kinase B
LigandBDBM50324266
Substrate/Competitorn/a
Meas. Tech.ChEMBL_650024 (CHEMBL1219722)
IC50 1870±n/a nM
Citation Chiang, CCLin, YHLin, SFLai, CLLiu, CWei, WYYang, SCWang, RWTeng, LWChuang, SHChang, JMYuan, TTLee, YSChen, PChi, WKYang, JYHuang, HJLiao, CBHuang, JJ Discovery of pyrrole-indoline-2-ones as Aurora kinase inhibitors with a different inhibition profile. J Med Chem53:5929-41 (2010) 
 
Aurora kinase B
Name:Aurora kinase B
Type:Protein
Mol. Mass.:39327.72
Organism:Homo sapiens (Human)
Description:Q96GD4
Residue:344
BDBM50324266
NameBDBM50324266
Synonyms:(Z)-3-(2-{[5-(Morpholinosulfonyl)-2-oxoindolin-3-ylidene]-methyl}-4-oxo-4,5,6,7-tetrahydro-1H-indol-3-yl)propanoic Acid | CHEMBL1215145
TypeSmall organic molecule
Emp. Form.C24H25N3O7S
Mol. Mass.499.536
SMILESOC(=O)CCc1c(C=C2C(=O)Nc3ccc(cc23)S(=O)(=O)N2CCOCC2)[nH]c2CCCC(=O)c12