Reaction Details
TargetVascular endothelial growth factor receptor 2
LigandBDBM50324277
Substrate/Competitorn/a
Meas. Tech.ChEMBL_650084 (CHEMBL1219782)
IC50<1000±n/a nM
Citation Chiang, CCLin, YHLin, SFLai, CLLiu, CWei, WYYang, SCWang, RWTeng, LWChuang, SHChang, JMYuan, TTLee, YSChen, PChi, WKYang, JYHuang, HJLiao, CBHuang, JJ Discovery of pyrrole-indoline-2-ones as Aurora kinase inhibitors with a different inhibition profile. J Med Chem53:5929-41 (2010) 
 
Vascular endothelial growth factor receptor 2
Name:Vascular endothelial growth factor receptor 2
Type:Receptor Tyrosine Kinase
Mol. Mass.:151510.97
Organism:Homo sapiens (Human)
Description:P35968
Residue:1356
BDBM50324277
NameBDBM50324277
Synonyms:(Z)-N-[3-({3-[3-(Dimethylamino)propyl]-4-oxo-4,5,6,7-tetrahydro-1H-indol-2-yl}methylene)-2-oxoindolin-5-yl]benzenesulfonamide | CHEMBL1215346
TypeSmall organic molecule
Emp. Form.C28H30N4O4S
Mol. Mass.518.627
SMILESCN(C)CCCc1c(C=C2C(=O)Nc3ccc(NS(=O)(=O)c4ccccc4)cc23)[nH]c2CCCC(=O)c12