Reaction Details
TargetAurora kinase A
LigandBDBM50324250
Substrate/Competitorn/a
Meas. Tech.ChEMBL_650022 (CHEMBL1219720)
IC50 362±n/a nM
Citation Chiang, CCLin, YHLin, SFLai, CLLiu, CWei, WYYang, SCWang, RWTeng, LWChuang, SHChang, JMYuan, TTLee, YSChen, PChi, WKYang, JYHuang, HJLiao, CBHuang, JJ Discovery of pyrrole-indoline-2-ones as Aurora kinase inhibitors with a different inhibition profile. J Med Chem53:5929-41 (2010) 
 
Aurora kinase A
Name:Aurora kinase A
Type:Serine/threonine-protein kinase
Mol. Mass.:45830.98
Organism:Homo sapiens (Human)
Description:O14965
Residue:403
BDBM50324250
NameBDBM50324250
Synonyms:(Z)-3-{4-Acetyl-2-[(5-fluoro-2-oxoindolin-3-ylidene)methyl]-5-methyl-1H-pyrrol-3-yl}propanoic Acid | CHEMBL1214853
TypeSmall organic molecule
Emp. Form.C19H17FN2O4
Mol. Mass.356.3477
SMILESCC(=O)c1c(C)[nH]c(C=C2C(=O)Nc3ccc(F)cc23)c1CCC(O)=O