Reaction Details
TargetAurora kinase A
LigandBDBM50324253
Substrate/Competitorn/a
Meas. Tech.ChEMBL_650022 (CHEMBL1219720)
IC50 357±n/a nM
Citation Chiang, CCLin, YHLin, SFLai, CLLiu, CWei, WYYang, SCWang, RWTeng, LWChuang, SHChang, JMYuan, TTLee, YSChen, PChi, WKYang, JYHuang, HJLiao, CBHuang, JJ Discovery of pyrrole-indoline-2-ones as Aurora kinase inhibitors with a different inhibition profile. J Med Chem53:5929-41 (2010) 
 
Aurora kinase A
Name:Aurora kinase A
Type:Serine/threonine-protein kinase
Mol. Mass.:45830.98
Organism:Homo sapiens (Human)
Description:O14965
Residue:403
BDBM50324253
NameBDBM50324253
Synonyms:(Z)-3-(2-{[5-(4-Hydroxy-3-methoxyphenyl)-2-oxoindolin-3-ylidene]methyl}-4-oxo-4,5,6,7-tetrahydro-1H-indol-3-yl)propanoic Acid | CHEMBL1214856
TypeSmall organic molecule
Emp. Form.C27H24N2O6
Mol. Mass.472.4893
SMILESCOc1cc(ccc1O)-c1ccc2NC(=O)C(=Cc3[nH]c4CCCC(=O)c4c3CCC(O)=O)c2c1