Reaction Details
TargetAurora kinase A
LigandBDBM50324273
Substrate/Competitorn/a
Meas. Tech.ChEMBL_650022 (CHEMBL1219720)
IC50 281±n/a nM
Citation Chiang, CCLin, YHLin, SFLai, CLLiu, CWei, WYYang, SCWang, RWTeng, LWChuang, SHChang, JMYuan, TTLee, YSChen, PChi, WKYang, JYHuang, HJLiao, CBHuang, JJ Discovery of pyrrole-indoline-2-ones as Aurora kinase inhibitors with a different inhibition profile. J Med Chem53:5929-41 (2010) 
 
Aurora kinase A
Name:Aurora kinase A
Type:Serine/threonine-protein kinase
Mol. Mass.:45830.98
Organism:Homo sapiens (Human)
Description:O14965
Residue:403
BDBM50324273
NameBDBM50324273
Synonyms:(Z)-N-(3-{[3-(3-Morpholino-3-oxopropyl)-4-oxo-4,5,6,7-tetrahydro-1H-indol-2-yl]methylene}-2-oxoindolin-5-yl)benzenesulfonamide | CHEMBL1215281
TypeSmall organic molecule
Emp. Form.C30H30N4O6S
Mol. Mass.574.647
SMILESO=C(CCc1c(C=C2C(=O)Nc3ccc(NS(=O)(=O)c4ccccc4)cc23)[nH]c2CCCC(=O)c12)N1CCOCC1