Reaction Details
Target5-hydroxytryptamine receptor 2A
LigandBDBM50324541
Substrate/Competitorn/a
Meas. Tech.ChEMBL_649396 (CHEMBL1219094)
Ki 0.51±n/a nM
Citation Xiong, YUllman, BChoi, JSCherrier, MStrah-Pleynet, SDecaire, MDosa, PIFeichtinger, KTeegarden, BRFrazer, JMYoon, WHShan, YWhelan, KHauser, EKGrottick, AJSemple, GAl-Shamma, H Synthesis and in vivo evaluation of phenethylpiperazine amides: selective 5-hydroxytryptamine(2A) receptor antagonists for the treatment of insomnia. J Med Chem53:5696-706 (2010) 
 
5-hydroxytryptamine receptor 2A
Name:5-hydroxytryptamine receptor 2A
Type:undefined
Mol. Mass.:52607.65
Organism:Homo sapiens (Human)
Description:P28223
Residue:471
BDBM50324541
NameBDBM50324541
Synonyms:1-[3-(4-Bromo-2-methyl-2H-pyrazol-3-yl)-4-methoxyphenyl]-3-(2,4-difluorophenyl)urea Nelotanserin
TypeSmall organic molecule
Emp. Form.C18H15BrF2N4O2
Mol. Mass.437.238
SMILESCOc1ccc(NC(=O)Nc2ccc(F)cc2F)cc1-c1c(Br)cnn1C