Reaction Details
Target5-hydroxytryptamine receptor 2A
LigandBDBM50324542
Substrate/Competitorn/a
Meas. Tech.ChEMBL_649427 (CHEMBL1219125)
Ki 2.7±n/a nM
Citation Xiong, YUllman, BChoi, JSCherrier, MStrah-Pleynet, SDecaire, MDosa, PIFeichtinger, KTeegarden, BRFrazer, JMYoon, WHShan, YWhelan, KHauser, EKGrottick, AJSemple, GAl-Shamma, H Synthesis and in vivo evaluation of phenethylpiperazine amides: selective 5-hydroxytryptamine(2A) receptor antagonists for the treatment of insomnia. J Med Chem53:5696-706 (2010) 
 
5-hydroxytryptamine receptor 2A
Name:5-hydroxytryptamine receptor 2A
Type:PROTEIN
Mol. Mass.:52384.55
Organism:Canis familiaris
Description:ChEMBL_1361183
Residue:470
BDBM50324542
NameBDBM50324542
Synonyms:2-[4-(4-Chloro-1-methyl-1H-pyrazole-3-carbonyl)piperazin-1-yl]-1-(4-fluorophenyl)ethanone | CHEMBL1214946
TypeSmall organic molecule
Emp. Form.C17H18ClFN4O2
Mol. Mass.364.802
SMILESCn1cc(Cl)c(n1)C(=O)N1CCN(CC(=O)c2ccc(F)cc2)CC1