Reaction Details
Target5-hydroxytryptamine receptor 2A
LigandBDBM50324566
Substrate/Competitorn/a
Meas. Tech.ChEMBL_649396 (CHEMBL1219094)
Ki 9.3±n/a nM
Citation Xiong, YUllman, BChoi, JSCherrier, MStrah-Pleynet, SDecaire, MDosa, PIFeichtinger, KTeegarden, BRFrazer, JMYoon, WHShan, YWhelan, KHauser, EKGrottick, AJSemple, GAl-Shamma, H Synthesis and in vivo evaluation of phenethylpiperazine amides: selective 5-hydroxytryptamine(2A) receptor antagonists for the treatment of insomnia. J Med Chem53:5696-706 (2010) 
 
5-hydroxytryptamine receptor 2A
Name:5-hydroxytryptamine receptor 2A
Type:undefined
Mol. Mass.:52607.65
Organism:Homo sapiens (Human)
Description:P28223
Residue:471
BDBM50324566
NameBDBM50324566
Synonyms:2-[4-(1-tert-Butyl-5-methyl-1H-pyrazole-3-carbonyl)piperazin-1-yl]-1-(4-fluorophenyl)ethanone | CHEMBL1214882
TypeSmall organic molecule
Emp. Form.C21H27FN4O2
Mol. Mass.386.4631
SMILESCc1cc(nn1C(C)(C)C)C(=O)N1CCN(CC(=O)c2ccc(F)cc2)CC1