Reaction Details
Target5-hydroxytryptamine receptor 2A
LigandBDBM50324571
Substrate/Competitorn/a
Meas. Tech.ChEMBL_649396 (CHEMBL1219094)
Ki 11±n/a nM
Citation Xiong, YUllman, BChoi, JSCherrier, MStrah-Pleynet, SDecaire, MDosa, PIFeichtinger, KTeegarden, BRFrazer, JMYoon, WHShan, YWhelan, KHauser, EKGrottick, AJSemple, GAl-Shamma, H Synthesis and in vivo evaluation of phenethylpiperazine amides: selective 5-hydroxytryptamine(2A) receptor antagonists for the treatment of insomnia. J Med Chem53:5696-706 (2010) 
 
5-hydroxytryptamine receptor 2A
Name:5-hydroxytryptamine receptor 2A
Type:undefined
Mol. Mass.:52607.65
Organism:Homo sapiens (Human)
Description:P28223
Residue:471
BDBM50324571
NameBDBM50324571
Synonyms:1-(4-Fluorophenyl)-2-[4-(5-methyl-2-phenyl-2H-pyrazole-3-carbonyl)piperazin-1-yl]ethanone | CHEMBL1215019
TypeSmall organic molecule
Emp. Form.C23H23FN4O2
Mol. Mass.406.4527
SMILESCc1cc(nn1-c1ccccc1)C(=O)N1CCN(CC(=O)c2ccc(F)cc2)CC1