Reaction Details
TargetSigma non-opioid intracellular receptor 1
LigandBDBM50324628
Substrate/Competitorn/a
Meas. Tech.ChEMBL_649602 (CHEMBL1219300)
Ki 1.9±n/a nM
Citation Prezzavento, OCampisi, AParenti, CRonsisvalle, SAricò, GArena, EPistolozzi, MScoto, GMBertucci, CVanella, ARonsisvalle, G Synthesis and resolution of cis-(+/-)-methyl (1R,2S/1S,2R)-2-[(4-hydroxy-4-phenylpiperidin-1-yl)methyl]-1-(4-methylphenyl)cyclopropanecarboxylate [(+/-)-PPCC)]: new sigma receptor ligands with neuroprotective effect. J Med Chem53:5881-5 (2010) 
 
Sigma non-opioid intracellular receptor 1
Name:Sigma non-opioid intracellular receptor 1
Type:Protein
Mol. Mass.:25307.17
Organism:Cavia porcellus (Guinea pig)
Description:Q60492
Residue:223
BDBM50324628
NameBDBM50324628
Synonyms:(+)-Methyl(1R,2S)-2-[(4-Hydroxy-4-phenylpiperidin-1-yl)-methyl]-1-(4-nitrophenyl)cyclopropanecarboxylate | CHEMBL1215856
TypeSmall organic molecule
Emp. Form.C24H29NO3
Mol. Mass.379.492
SMILESCOC(=O)[C@@]1(C[C@@H]1CN1CCC(O)(CC1)c1ccccc1)c1ccc(C)cc1