Reaction Details
TargetRibosomal protein S6 kinase alpha-3
LigandBDBM50324685
Substrate/Competitorn/a
Meas. Tech.ChEMBL_650368 (CHEMBL1225084)
IC50 20±n/a nM
Citation Cohen, MSHadjivassiliou, HTaunton, J A clickable inhibitor reveals context-dependent autoactivation of p90 RSK. Nat Chem Biol3:156-60 (2007) 
 
Ribosomal protein S6 kinase alpha-3
Name:Ribosomal protein S6 kinase alpha-3
Type:Serine/threonine-protein kinase
Mol. Mass.:83740.03
Organism:Homo sapiens (Human)
Description:The human RSK2 sequence differed from the Genbank entry NM_004586 at one residue, V45G. The protein was cloned and purified from baculovirus expression system.
Residue:740
BDBM50324685
NameBDBM50324685
Synonyms:2-(3-(4-amino-6-(2-fluoroacetyl)-5-p-tolyl-7H-pyrrolo[2,3-d]pyrimidin-7-yl)propylamino)acetonitrile | CHEMBL1221698
TypeSmall organic molecule
Emp. Form.C20H21FN6O
Mol. Mass.380.4187
SMILESCc1ccc(cc1)-c1c(C(=O)CF)n(CCCNCC#N)c2ncnc(N)c12