Reaction Details
TargetMonoglyceride lipase
LigandBDBM50324698
Substrate/Competitorn/a
Meas. Tech.ChEMBL_653421 (CHEMBL1226624)
IC50 5±n/a nM
Citation Nomura, DKBlankman, JLSimon, GMFujioka, KIssa, RSWard, AMCravatt, BFCasida, JE Activation of the endocannabinoid system by organophosphorus nerve agents. Nat Chem Biol4:373-8 (2008) 
 
Monoglyceride lipase
Name:Monoglyceride lipase
Type:Hydrolase
Mol. Mass.:33391.67
Organism:Mus musculus (mouse)
Description:Assays were using membranes of recombinant MAG Lipase transiently transfected in COS-7 cells.
Residue:303
BDBM50324698
NameBDBM50324698
Synonyms:CHEMBL1222256 | Ethyl octylfluorophosphonate
TypeSmall organic molecule
Emp. Form.C11H24FO2P
Mol. Mass.238.2792
SMILESCCCCCCCCP(F)(=O)OC(C)C