Reaction Details
TargetIndoleamine 2,3-dioxygenase 1
LigandBDBM50324699
Substrate/Competitorn/a
Meas. Tech.ChEMBL_650626 (CHEMBL1225185)
Ki 80±n/a nM
Citation Volgraf, MLumb, JPBrastianos, HCCarr, GChung, MKMünzel, MMauk, AGAndersen, RJTrauner, D Biomimetic synthesis of the IDO inhibitors exiguamine A and B. Nat Chem Biol4:535-7 (2008) 
 
Indoleamine 2,3-dioxygenase 1
Name:Indoleamine 2,3-dioxygenase 1
Type:Enzyme
Mol. Mass.:45330.80
Organism:Homo sapiens (Human)
Description:P14902
Residue:403
BDBM50324699
NameBDBM50324699
Synonyms:CHEMBL1221473 | Seco-exiguamine
TypeSmall organic molecule
Emp. Form.C25H29N5O6
Mol. Mass.495.5277
SMILESCN(C)CCc1ccc(O)c(O)c1C1=C(c2c(O)n(C)c(=O)n2C)C(=O)c2c(CCN)c[nH]c2C1=O