Reaction Details
TargetD(3) dopamine receptor
LigandBDBM50119380
Substrate/Competitorn/a
Meas. Tech.ChEMBL_651511 (CHEMBL1227763)
Ki 20.2±n/a nM
Citation Résimont, MLiégeois, JF Synthesis and in vitro binding studies of piperazine-alkyl-naphthamides: impact of homology and sulphonamide/carboxamide bioisosteric replacement on the affinity for 5-HT1A, alpha2A, D4.2, D3 and D2L receptors. Bioorg Med Chem Lett20:5199-202 (2010) 
 
D(3) dopamine receptor
Name:D(3) dopamine receptor
Type:Protein
Mol. Mass.:49540.58
Organism:Rattus norvegicus (Rat)
Description:P19020
Residue:446
BDBM50119380
NameBDBM50119380
Synonyms:CHEMBL25236 N-(4-(4-(2-methoxyphenyl)piperazin-1-yl)butyl)-2-naphthamide | Naphthalene-2-carboxylic acid {4-[4-(2-methoxy-phenyl)-piperazin-1-yl]-butyl}-amide
TypeSmall organic molecule
Emp. Form.C26H31N3O2
Mol. Mass.417.5432
SMILESCOc1ccccc1N1CCN(CCCCNC(=O)c2ccc3ccccc3c2)CC1