Reaction Details
TargetBeta-secretase 1
LigandBDBM50324902
Substrate/Competitorn/a
Meas. Tech.ChEMBL_651539 (CHEMBL1227791)
IC50 1403000±n/a nM
Citation Madden, JDod, JRGodemann, RKraemer, JSmith, MBiniszkiewicz, MHallett, DJBarker, JDyekjaer, JDHesterkamp, T Fragment-based discovery and optimization of BACE1 inhibitors. Bioorg Med Chem Lett20:5329-33 (2010) 
 
Beta-secretase 1
Name:Beta-secretase 1
Type:Protein
Mol. Mass.:55755.10
Organism:Homo sapiens (Human)
Description:P56817
Residue:501
BDBM50324902
NameBDBM50324902
Synonyms:4-(2-amino-5-chloro-1H-benzo[d]imidazol-1-yl)-N-benzylbutanamide | CHEMBL1221976
TypeSmall organic molecule
Emp. Form.C18H19ClN4O
Mol. Mass.342.823
SMILESNc1nc2cc(Cl)ccc2n1CCCC(=O)NCc1ccccc1