Reaction Details
TargetBeta-secretase 1
LigandBDBM50324932
Substrate/Competitorn/a
Meas. Tech.ChEMBL_651539 (CHEMBL1227791)
IC50 87000±n/a nM
Citation Madden, JDod, JRGodemann, RKraemer, JSmith, MBiniszkiewicz, MHallett, DJBarker, JDyekjaer, JDHesterkamp, T Fragment-based discovery and optimization of BACE1 inhibitors. Bioorg Med Chem Lett20:5329-33 (2010) 
 
Beta-secretase 1
Name:Beta-secretase 1
Type:Protein
Mol. Mass.:55755.10
Organism:Homo sapiens (Human)
Description:P56817
Residue:501
BDBM50324932
NameBDBM50324932
Synonyms:(S)-2-((S)-3-(2-amino-5-chloro-1H-benzo[d]imidazol-1-yl)pentanamido)-3-tert-butoxypropanoic acid | CHEMBL1222368
TypeSmall organic molecule
Emp. Form.C19H27ClN4O4
Mol. Mass.410.895
SMILESCC[C@@H](CC(=O)N[C@@H](COC(C)(C)C)C(O)=O)n1c(N)nc2cc(Cl)ccc12