Reaction Details
TargetBeta-secretase 1
LigandBDBM50324915
Substrate/Competitorn/a
Meas. Tech.ChEMBL_651539 (CHEMBL1227791)
IC50 72000±n/a nM
Citation Madden, JDod, JRGodemann, RKraemer, JSmith, MBiniszkiewicz, MHallett, DJBarker, JDyekjaer, JDHesterkamp, T Fragment-based discovery and optimization of BACE1 inhibitors. Bioorg Med Chem Lett20:5329-33 (2010) 
 
Beta-secretase 1
Name:Beta-secretase 1
Type:Protein
Mol. Mass.:55755.10
Organism:Homo sapiens (Human)
Description:P56817
Residue:501
BDBM50324915
NameBDBM50324915
Synonyms:(S)-3-(2-amino-5-chloro-1H-benzo[d]imidazol-1-yl)-N-benzylpentanamide | CHEMBL1222142
TypeSmall organic molecule
Emp. Form.C19H21ClN4O
Mol. Mass.356.849
SMILESCC[C@@H](CC(=O)NCc1ccccc1)n1c(N)nc2cc(Cl)ccc12