Reaction Details
TargetBeta-secretase 1
LigandBDBM50324901
Substrate/Competitorn/a
Meas. Tech.ChEMBL_651539 (CHEMBL1227791)
IC50 776000±n/a nM
Citation Madden, JDod, JRGodemann, RKraemer, JSmith, MBiniszkiewicz, MHallett, DJBarker, JDyekjaer, JDHesterkamp, T Fragment-based discovery and optimization of BACE1 inhibitors. Bioorg Med Chem Lett20:5329-33 (2010) 
 
Beta-secretase 1
Name:Beta-secretase 1
Type:Protein
Mol. Mass.:55755.10
Organism:Homo sapiens (Human)
Description:P56817
Residue:501
BDBM50324901
NameBDBM50324901
Synonyms:2,2-dihydroxy-1H-indene-1,3(2H)-dione | CHEMBL1221925
TypeSmall organic molecule
Emp. Form.C9H6O4
Mol. Mass.178.1415
SMILESOC1(O)C(=O)c2ccccc2C1=O