Reaction Details
TargetPotassium voltage-gated channel subfamily H member 2
LigandBDBM17786
Substrate/Competitorn/a
Meas. Tech.ChEMBL_651537 (CHEMBL1227789)
Ki 84±n/a nM
Citation Madden, JDod, JRGodemann, RKraemer, JSmith, MBiniszkiewicz, MHallett, DJBarker, JDyekjaer, JDHesterkamp, T Fragment-based discovery and optimization of BACE1 inhibitors. Bioorg Med Chem Lett20:5329-33 (2010) 
 
Potassium voltage-gated channel subfamily H member 2
Name:Potassium voltage-gated channel subfamily H member 2
Type:Multi-pass membrane protein
Mol. Mass.:126672.65
Organism:Homo sapiens (Human)
Description:Q12809
Residue:1159
BDBM17786
NameBDBM17786
Synonyms:(4S)-4-(2-amino-6-phenoxy-3,4-dihydroquinazolin-3-yl)-N,4-dicyclohexyl-N-methylbutanamide | 2-aminoquinazoline, 3a
TypeSmall organic molecule
Emp. Form.C31H42N4O2
Mol. Mass.502.6908
SMILESCN(C1CCCCC1)C(=O)CC[C@@H](C1CCCCC1)N1Cc2cc(Oc3ccccc3)ccc2N=C1N