Reaction Details
TargetCaspase-1
LigandBDBM50324940
Substrate/Competitorn/a
Meas. Tech.ChEMBL_651545 (CHEMBL1227797)
Ki 9.24±n/a nM
Citation Galatsis, PCaprathe, BGilmore, JThomas, ALinn, KSheehan, SHarter, WKostlan, CLunney, EStankovic, CRubin, JBrady, KAllen, HTalanian, R Succinic acid amides as P2-P3 replacements for inhibitors of interleukin-1beta converting enzyme (ICE or caspase 1). Bioorg Med Chem Lett20:5184-90 (2010) 
 
Caspase-1
Name:Caspase-1
Type:Enzyme
Mol. Mass.:45154.13
Organism:Homo sapiens (Human)
Description:P29466
Residue:404
BDBM50324940
NameBDBM50324940
Synonyms:(R)-2-((S)-4-((2-carboxyethyl)(2-phenoxyethyl)amino)-2-isopropyl-4-oxobutanamido)-3-oxopropanoic acid | CHEMBL1221549
TypeSmall organic molecule
Emp. Form.C22H30N2O8
Mol. Mass.450.4822
SMILESCC(C)[C@H](CC(=O)N(CCOc1ccccc1)CCC(O)=O)C(=O)N[C@@H](CC(O)=O)C=O