Reaction Details
TargetCaspase-1
LigandBDBM50324944
Substrate/Competitorn/a
Meas. Tech.ChEMBL_651545 (CHEMBL1227797)
Ki 70.9±n/a nM
Citation Galatsis, PCaprathe, BGilmore, JThomas, ALinn, KSheehan, SHarter, WKostlan, CLunney, EStankovic, CRubin, JBrady, KAllen, HTalanian, R Succinic acid amides as P2-P3 replacements for inhibitors of interleukin-1beta converting enzyme (ICE or caspase 1). Bioorg Med Chem Lett20:5184-90 (2010) 
 
Caspase-1
Name:Caspase-1
Type:Enzyme
Mol. Mass.:45154.13
Organism:Homo sapiens (Human)
Description:P29466
Residue:404
BDBM50324944
NameBDBM50324944
Synonyms:(R)-2-((S)-2-isopropyl-4-(3-(4-methoxyphenyl)propylamino)-4-oxobutanamido)-3-oxopropanoic acid | CHEMBL1221503
TypeSmall organic molecule
Emp. Form.C21H30N2O6
Mol. Mass.406.4727
SMILESCOc1ccc(CCCNC(=O)C[C@@H](C(C)C)C(=O)N[C@@H](CC(O)=O)C=O)cc1