Reaction Details
TargetCaspase-1
LigandBDBM50324952
Substrate/Competitorn/a
Meas. Tech.ChEMBL_651546 (CHEMBL1227798)
Ki 13.4±n/a nM
Citation Galatsis, PCaprathe, BGilmore, JThomas, ALinn, KSheehan, SHarter, WKostlan, CLunney, EStankovic, CRubin, JBrady, KAllen, HTalanian, R Succinic acid amides as P2-P3 replacements for inhibitors of interleukin-1beta converting enzyme (ICE or caspase 1). Bioorg Med Chem Lett20:5184-90 (2010) 
 
Caspase-1
Name:Caspase-1
Type:PROTEIN
Mol. Mass.:45636.44
Organism:Mus musculus
Description:ChEMBL_651546
Residue:402
BDBM50324952
NameBDBM50324952
Synonyms:(R)-2-((S)-2-isopropyl-4-(2-(2-methyl-1H-indol-3-yl)ethylamino)-4-oxobutanamido)-3-oxopropanoic acid | CHEMBL1221643
TypeSmall organic molecule
Emp. Form.C22H29N3O5
Mol. Mass.415.4828
SMILESCC(C)[C@H](CC(=O)NCCc1c(C)[nH]c2ccccc12)C(=O)N[C@@H](CC(O)=O)C=O