Reaction Details
TargetCaspase-1
LigandBDBM50324955
Substrate/Competitorn/a
Meas. Tech.ChEMBL_651545 (CHEMBL1227797)
Ki 20±n/a nM
Citation Galatsis, PCaprathe, BGilmore, JThomas, ALinn, KSheehan, SHarter, WKostlan, CLunney, EStankovic, CRubin, JBrady, KAllen, HTalanian, R Succinic acid amides as P2-P3 replacements for inhibitors of interleukin-1beta converting enzyme (ICE or caspase 1). Bioorg Med Chem Lett20:5184-90 (2010) 
 
Caspase-1
Name:Caspase-1
Type:Enzyme
Mol. Mass.:45154.13
Organism:Homo sapiens (Human)
Description:P29466
Residue:404
BDBM50324955
NameBDBM50324955
Synonyms:(R)-2-((S)-4-(2-(1H-benzo[d]imidazol-1-yl)ethylamino)-2-isopropyl-4-oxobutanamido)-3-oxopropanoic acid | CHEMBL1221646
TypeSmall organic molecule
Emp. Form.C20H26N4O5
Mol. Mass.402.4442
SMILESCC(C)[C@H](CC(=O)NCCn1cnc2ccccc12)C(=O)N[C@@H](CC(O)=O)C=O