Reaction Details
TargetAdenosine receptor A1
LigandBDBM50324970
Substrate/Competitorn/a
Meas. Tech.ChEMBL_651580 (CHEMBL1227963)
Ki 780±n/a nM
Citation Sams, AGMikkelsen, GKLarsen, MTorup, LBrennum, LTSchrøder, TJBang-Andersen, B Hit-to-lead optimization of a series of carboxamides of ethyl 2-amino-4-phenylthiazole-5-carboxylates as novel adenosine A2A receptor antagonists. Bioorg Med Chem Lett20:5241-4 (2010) 
 
Adenosine receptor A1
Name:Adenosine receptor A1
Type:G Protein-Coupled Receptor (GPCR)
Mol. Mass.:36520.92
Organism:Homo sapiens (Human)
Description:P30542
Residue:326
BDBM50324970
NameBDBM50324970
Synonyms:CHEMBL1222246 | Furan-2-carboxylic acid[5-(5-methyl-[1,2,4]oxadiazol-3-yl)-4-phenyl-thiazol-2-yl]-amide
TypeSmall organic molecule
Emp. Form.C17H12N4O3S
Mol. Mass.352.367
SMILESCc1nc(no1)-c1sc(NC(=O)c2ccco2)nc1-c1ccccc1