Reaction Details
TargetAdenosine receptor A1
LigandBDBM50324987
Substrate/Competitorn/a
Meas. Tech.ChEMBL_651580 (CHEMBL1227963)
Ki 650±n/a nM
Citation Sams, AGMikkelsen, GKLarsen, MTorup, LBrennum, LTSchrøder, TJBang-Andersen, B Hit-to-lead optimization of a series of carboxamides of ethyl 2-amino-4-phenylthiazole-5-carboxylates as novel adenosine A2A receptor antagonists. Bioorg Med Chem Lett20:5241-4 (2010) 
 
Adenosine receptor A1
Name:Adenosine receptor A1
Type:G Protein-Coupled Receptor (GPCR)
Mol. Mass.:36520.92
Organism:Homo sapiens (Human)
Description:P30542
Residue:326
BDBM50324987
NameBDBM50324987
Synonyms:CHEMBL1221505 | Furan-2-carboxylic acid[5-(2-ethyl-2H-tetrazol-5-yl)-4-phenyl-thiazol-2-yl]-amide
TypeSmall organic molecule
Emp. Form.C17H14N6O2S
Mol. Mass.366.397
SMILESCCn1nnc(n1)-c1sc(NC(=O)c2ccco2)nc1-c1ccccc1