Reaction Details
TargetCannabinoid receptor 1
LigandBDBM50325230
Substrate/Competitorn/a
Meas. Tech.ChEMBL_651838 (CHEMBL1227203)
IC50 1.79±n/a nM
Citation Lee, JSeo, HJLee, SHKim, JJung, MELee, SHSong, KSLee, JKang, SYKim, MJKim, MSSon, EJLee, MHan, HK Discovery of 2-(4-((1H-1,2,4-triazol-1-yl)methyl)-5-(4-bromophenyl)-1-(2-chlorophenyl)-1H-pyrazol-3-yl)-5-tert-butyl-1,3,4-thiadiazole (GCC2680) as a potent, selective and orally efficacious cannabinoid-1 receptor antagonist. Bioorg Med Chem18:6377-88 (2010) 
 
Cannabinoid receptor 1
Name:Cannabinoid receptor 1
Type:G Protein-Coupled Receptor (GPCR)
Mol. Mass.:52856.55
Organism:Rattus norvegicus (rat)
Description:P20272
Residue:473
BDBM50325230
NameBDBM50325230
Synonyms:2-(4-((1H-1,2,4-Triazol-1-yl)methyl)-5-(4-chlorophenyl)-1-(2,4-dichlorophenyl)-1H-pyrazol-3-yl)-5-(1-phenylcyclopropyl)-1,3,4-thiadiazole | CHEMBL1223031
TypeSmall organic molecule
Emp. Form.C29H20Cl3N7S
Mol. Mass.604.94
SMILESClc1ccc(cc1)-c1c(Cn2cncn2)c(nn1-c1ccc(Cl)cc1Cl)-c1nnc(s1)C1(CC1)c1ccccc1