Reaction Details
TargetSteroid 17-alpha-hydroxylase/17,20 lyase
LigandBDBM50325330
Substrate/Competitorn/a
Meas. Tech.ChEMBL_652120 (CHEMBL1228229)
IC50 30±n/a nM
Citation Owen, CPShahid, ILee, WYAhmed, S Synthesis and biochemical evaluation of a range of (4-substituted phenyl)sulfonate derivatives of 4-hydroxybenzyl imidazole-based compounds as potent inhibitors of 17alpha-hydroxylase/17,20-lyase (P45017alpha) derived from rat testicular microsomes. Bioorg Med Chem Lett20:5345-8 (2010) 
 
Steroid 17-alpha-hydroxylase/17,20 lyase
Name:Steroid 17-alpha-hydroxylase/17,20 lyase
Type:Enzyme
Mol. Mass.:57255.68
Organism:Rattus norvegicus (Rat)
Description:P11715
Residue:507
BDBM50325330
NameBDBM50325330
Synonyms:4-((1H-imidazol-1-yl)methyl)phenyl 4-propylbenzenesulfonate | CHEMBL1222922
TypeSmall organic molecule
Emp. Form.C19H20N2O3S
Mol. Mass.356.439
SMILESCCCc1ccc(cc1)S(=O)(=O)Oc1ccc(Cn2ccnc2)cc1