Reaction Details
TargetKappa-type opioid receptor
LigandBDBM50325530
Substrate/Competitorn/a
Meas. Tech.ChEMBL_652217 (CHEMBL1228490)
Ki 1.24±n/a nM
Citation Fujii, HIda, YHanamura, SOsa, YNemoto, TNakajima, MHasebe, KNakao, KMochizuki, HNagase, H Synthesis of pyrrolomorphinan derivatives as kappa opioid agonists. Bioorg Med Chem Lett20:5035-8 (2010) 
 
Kappa-type opioid receptor
Name:Kappa-type opioid receptor
Type:G Protein-Coupled Receptor (GPCR)
Mol. Mass.:42744.99
Organism:Cavia porcellus (domestic guinea pig)
Description:P41144
Residue:380
BDBM50325530
NameBDBM50325530
Synonyms:CHEMBL1223833
TypeSmall organic molecule
Emp. Form.C31H38N2O4
Mol. Mass.502.6444
SMILESCCCCCC(=O)C=Cc1cc2C[C@@]3(O)[C@H]4Cc5ccc(O)c6O[C@@H](c2n1C)[C@]3(CCN4CC1CC1)c56