Reaction Details
TargetMu-type opioid receptor
LigandBDBM50325528
Substrate/Competitorn/a
Meas. Tech.ChEMBL_652218 (CHEMBL1228491)
Ki 3.76±n/a nM
Citation Fujii, HIda, YHanamura, SOsa, YNemoto, TNakajima, MHasebe, KNakao, KMochizuki, HNagase, H Synthesis of pyrrolomorphinan derivatives as kappa opioid agonists. Bioorg Med Chem Lett20:5035-8 (2010) 
 
Mu-type opioid receptor
Name:Mu-type opioid receptor
Type:Enzyme Catalytic Domain
Mol. Mass.:11165.58
Organism:GUINEA PIG
Description:P97266
Residue:98
BDBM50325528
NameBDBM50325528
Synonyms:CHEMBL1223831
TypeSmall organic molecule
Emp. Form.C32H32N2O4
Mol. Mass.508.6075
SMILESCn1c(\C=C\C(=O)c2ccccc2)cc2C[C@@]3(O)[C@H]4Cc5ccc(O)c6O[C@@H](c12)[C@]3(CCN4CC1CC1)c56