Reaction Details
TargetCannabinoid receptor 2
LigandBDBM50325577
Substrate/Competitorn/a
Meas. Tech.ChEMBL_652252 (CHEMBL1225455)
Ki 89±n/a nM
Citation Lange, JHAttali, Avan der Neut, MAWals, HCMulder, AZilaout, HDuursma, Avan Aken, HHvan Vliet, BJ Two distinct classes of novel pyrazolinecarboxamides as potent cannabinoid CB1 receptor agonists. Bioorg Med Chem Lett20:4992-8 (2010) 
 
Cannabinoid receptor 2
Name:Cannabinoid receptor 2
Type:G Protein-Coupled Receptor (GPCR)
Mol. Mass.:39690.94
Organism:Homo sapiens (Human)
Description:P34972
Residue:360
BDBM50325577
NameBDBM50325577
Synonyms:3-butyl-4-(2-fluorophenyl)-N-(2-(4-fluorophenyl)propan-2-yl)-4,5-dihydro-1H-pyrazole-1-carboxamide | CHEMBL1223591
TypeSmall organic molecule
Emp. Form.C23H27F2N3O
Mol. Mass.399.4768
SMILESCCCCC1=NN(CC1c1ccccc1F)C(=O)NC(C)(C)c1ccc(F)cc1