Reaction Details
TargetCannabinoid receptor 1
LigandBDBM50325580
Substrate/Competitorn/a
Meas. Tech.ChEMBL_652250 (CHEMBL1225453)
Ki 15.3±n/a nM
Citation Lange, JHAttali, Avan der Neut, MAWals, HCMulder, AZilaout, HDuursma, Avan Aken, HHvan Vliet, BJ Two distinct classes of novel pyrazolinecarboxamides as potent cannabinoid CB1 receptor agonists. Bioorg Med Chem Lett20:4992-8 (2010) 
 
Cannabinoid receptor 1
Name:Cannabinoid receptor 1
Type:G Protein-Coupled Receptor (GPCR)
Mol. Mass.:52868.96
Organism:Homo sapiens (Human)
Description:P21554
Residue:472
BDBM50325580
NameBDBM50325580
Synonyms:CHEMBL1223647 | N-cycloheptyl-3-pentyl-4-phenyl-4,5-dihydro-1H-pyrazole-1-carboxamide
TypeSmall organic molecule
Emp. Form.C22H33N3O
Mol. Mass.355.5169
SMILESCCCCCC1=NN(CC1c1ccccc1)C(=O)NC1CCCCCC1