Reaction Details
TargetCannabinoid receptor 2
LigandBDBM50325581
Substrate/Competitorn/a
Meas. Tech.ChEMBL_652252 (CHEMBL1225455)
Ki 26.6±n/a nM
Citation Lange, JHAttali, Avan der Neut, MAWals, HCMulder, AZilaout, HDuursma, Avan Aken, HHvan Vliet, BJ Two distinct classes of novel pyrazolinecarboxamides as potent cannabinoid CB1 receptor agonists. Bioorg Med Chem Lett20:4992-8 (2010) 
 
Cannabinoid receptor 2
Name:Cannabinoid receptor 2
Type:G Protein-Coupled Receptor (GPCR)
Mol. Mass.:39690.94
Organism:Homo sapiens (Human)
Description:P34972
Residue:360
BDBM50325581
NameBDBM50325581
Synonyms:CHEMBL1223648 | N-cyclooctyl-3-pentyl-4-phenyl-4,5-dihydro-1H-pyrazole-1-carboxamide
TypeSmall organic molecule
Emp. Form.C23H35N3O
Mol. Mass.369.5435
SMILESCCCCCC1=NN(CC1c1ccccc1)C(=O)NC1CCCCCCC1