Reaction Details
TargetCannabinoid receptor 2
LigandBDBM50325587
Substrate/Competitorn/a
Meas. Tech.ChEMBL_652252 (CHEMBL1225455)
Ki 3.4±n/a nM
Citation Lange, JHAttali, Avan der Neut, MAWals, HCMulder, AZilaout, HDuursma, Avan Aken, HHvan Vliet, BJ Two distinct classes of novel pyrazolinecarboxamides as potent cannabinoid CB1 receptor agonists. Bioorg Med Chem Lett20:4992-8 (2010) 
 
Cannabinoid receptor 2
Name:Cannabinoid receptor 2
Type:G Protein-Coupled Receptor (GPCR)
Mol. Mass.:39690.94
Organism:Homo sapiens (Human)
Description:P34972
Residue:360
BDBM50325587
NameBDBM50325587
Synonyms:3-butyl-5,5-dimethyl-4-phenyl-N-((1R,2S,4R)-1,7,7-trimethylbicyclo[2.2.1]heptan-2-yl)-4,5-dihydro-1H-pyrazole-1-carboxamide | CHEMBL1223775
TypeSmall organic molecule
Emp. Form.C26H39N3O
Mol. Mass.409.6074
SMILESCCCCC1=NN(C(=O)N[C@H]2C[C@H]3CC[C@]2(C)C3(C)C)C(C)(C)C1c1ccccc1