Reaction Details
TargetCannabinoid receptor 2
LigandBDBM50325589
Substrate/Competitorn/a
Meas. Tech.ChEMBL_652252 (CHEMBL1225455)
Ki 121±n/a nM
Citation Lange, JHAttali, Avan der Neut, MAWals, HCMulder, AZilaout, HDuursma, Avan Aken, HHvan Vliet, BJ Two distinct classes of novel pyrazolinecarboxamides as potent cannabinoid CB1 receptor agonists. Bioorg Med Chem Lett20:4992-8 (2010) 
 
Cannabinoid receptor 2
Name:Cannabinoid receptor 2
Type:G Protein-Coupled Receptor (GPCR)
Mol. Mass.:39690.94
Organism:Homo sapiens (Human)
Description:P34972
Residue:360
BDBM50325589
NameBDBM50325589
Synonyms:CHEMBL1223777 | N-(2-(4-fluorophenyl)propan-2-yl)-1-pentyl-5-phenyl-4,5-dihydro-1H-pyrazole-3-carboxamide
TypeSmall organic molecule
Emp. Form.C24H30FN3O
Mol. Mass.395.5129
SMILESCCCCCN1N=C(CC1c1ccccc1)C(=O)NC(C)(C)c1ccc(F)cc1