Reaction Details
TargetCannabinoid receptor 2
LigandBDBM50325591
Substrate/Competitorn/a
Meas. Tech.ChEMBL_652252 (CHEMBL1225455)
Ki 9.1±n/a nM
Citation Lange, JHAttali, Avan der Neut, MAWals, HCMulder, AZilaout, HDuursma, Avan Aken, HHvan Vliet, BJ Two distinct classes of novel pyrazolinecarboxamides as potent cannabinoid CB1 receptor agonists. Bioorg Med Chem Lett20:4992-8 (2010) 
 
Cannabinoid receptor 2
Name:Cannabinoid receptor 2
Type:G Protein-Coupled Receptor (GPCR)
Mol. Mass.:39690.94
Organism:Homo sapiens (Human)
Description:P34972
Residue:360
BDBM50325591
NameBDBM50325591
Synonyms:5-(2-fluorophenyl)-1-pentyl-N-((1R,2S,4R)-1,7,7-trimethylbicyclo[2.2.1]heptan-2-yl)-4,5-dihydro-1H-pyrazole-3-carboxamide | CHEMBL1223835
TypeSmall organic molecule
Emp. Form.C25H36FN3O
Mol. Mass.413.5712
SMILESCCCCCN1N=C(CC1c1ccccc1F)C(=O)N[C@H]1C[C@H]2CC[C@]1(C)C2(C)C