Reaction Details
TargetCannabinoid receptor 2
LigandBDBM50325594
Substrate/Competitorn/a
Meas. Tech.ChEMBL_652252 (CHEMBL1225455)
Ki 53±n/a nM
Citation Lange, JHAttali, Avan der Neut, MAWals, HCMulder, AZilaout, HDuursma, Avan Aken, HHvan Vliet, BJ Two distinct classes of novel pyrazolinecarboxamides as potent cannabinoid CB1 receptor agonists. Bioorg Med Chem Lett20:4992-8 (2010) 
 
Cannabinoid receptor 2
Name:Cannabinoid receptor 2
Type:G Protein-Coupled Receptor (GPCR)
Mol. Mass.:39690.94
Organism:Homo sapiens (Human)
Description:P34972
Residue:360
BDBM50325594
NameBDBM50325594
Synonyms:3-Pentyl-4-phenyl-4,5-dihydro-pyrazole-1-carboxylic acid cyclohexylmet hyl-amide | CHEMBL1224688
TypeSmall organic molecule
Emp. Form.C22H33N3O
Mol. Mass.355.5169
SMILESCCCCCC1=NN(CC1c1ccccc1)C(=O)NCC1CCCCC1