Reaction Details
TargetCannabinoid receptor 1
LigandBDBM50325596
Substrate/Competitorn/a
Meas. Tech.ChEMBL_652250 (CHEMBL1225453)
Ki 15.6±n/a nM
Citation Lange, JHAttali, Avan der Neut, MAWals, HCMulder, AZilaout, HDuursma, Avan Aken, HHvan Vliet, BJ Two distinct classes of novel pyrazolinecarboxamides as potent cannabinoid CB1 receptor agonists. Bioorg Med Chem Lett20:4992-8 (2010) 
 
Cannabinoid receptor 1
Name:Cannabinoid receptor 1
Type:G Protein-Coupled Receptor (GPCR)
Mol. Mass.:52868.96
Organism:Homo sapiens (Human)
Description:P21554
Residue:472
BDBM50325596
NameBDBM50325596
Synonyms:CHEMBL1224631 | N-(((1S,2R,5S)-6,6-dimethylbicyclo[3.1.1]heptan-2-yl)methyl)-3-pentyl-4-phenyl-4,5-dihydro-1H-pyrazole-1-carboxamide
TypeSmall organic molecule
Emp. Form.C25H37N3O
Mol. Mass.395.5808
SMILESCCCCCC1=NN(CC1c1ccccc1)C(=O)NC[C@@H]1CC[C@H]2C[C@@H]1C2(C)C