Reaction Details
TargetCytochrome P450 2D6
LigandBDBM50325617
Substrate/Competitorn/a
Meas. Tech.ChEMBL_652285 (CHEMBL1225488)
IC50 4100±n/a nM
Citation Lucas, MCWeikert, RJCarter, DSCai, HYGreenhouse, RIyer, PSLin, CJLee, EKMadera, AMMoore, AOzboya, KSchoenfeld, RCSteiner, SZhai, YLynch, SM Design, synthesis, and biological evaluation of new monoamine reuptake inhibitors with potential therapeutic utility in depression and pain. Bioorg Med Chem Lett20:5559-66 (2010) 
 
Cytochrome P450 2D6
Name:Cytochrome P450 2D6
Type:Protein
Mol. Mass.:55774.82
Organism:Homo sapiens (Human)
Description:P10635
Residue:497
BDBM50325617
NameBDBM50325617
Synonyms:(3-(ethoxymethyl)pyrrolidin-3-yl)(7-fluoro-1H-indol-5-yl)methanone | CHEMBL1224491
TypeSmall organic molecule
Emp. Form.C16H19FN2O2
Mol. Mass.290.3327
SMILESCCOCC1(CCNC1)C(=O)c1cc(F)c2[nH]ccc2c1