Reaction Details
TargetCytochrome P450 2D6
LigandBDBM50325626
Substrate/Competitorn/a
Meas. Tech.ChEMBL_652285 (CHEMBL1225488)
IC50 4000±n/a nM
Citation Lucas, MCWeikert, RJCarter, DSCai, HYGreenhouse, RIyer, PSLin, CJLee, EKMadera, AMMoore, AOzboya, KSchoenfeld, RCSteiner, SZhai, YLynch, SM Design, synthesis, and biological evaluation of new monoamine reuptake inhibitors with potential therapeutic utility in depression and pain. Bioorg Med Chem Lett20:5559-66 (2010) 
 
Cytochrome P450 2D6
Name:Cytochrome P450 2D6
Type:Protein
Mol. Mass.:55774.82
Organism:Homo sapiens (Human)
Description:P10635
Residue:497
BDBM50325626
NameBDBM50325626
Synonyms:(4-amino-3-chlorophenyl)(3-(3,3-dimethylbutyl)pyrrolidin-3-yl)methanone | CHEMBL1224317
TypeSmall organic molecule
Emp. Form.C17H25ClN2O
Mol. Mass.308.846
SMILESCC(C)(C)CCC1(CCNC1)C(=O)c1ccc(N)c(Cl)c1