Reaction Details
TargetCytochrome P450 2D6
LigandBDBM50325639
Substrate/Competitorn/a
Meas. Tech.ChEMBL_652285 (CHEMBL1225488)
IC50 600±n/a nM
Citation Lucas, MCWeikert, RJCarter, DSCai, HYGreenhouse, RIyer, PSLin, CJLee, EKMadera, AMMoore, AOzboya, KSchoenfeld, RCSteiner, SZhai, YLynch, SM Design, synthesis, and biological evaluation of new monoamine reuptake inhibitors with potential therapeutic utility in depression and pain. Bioorg Med Chem Lett20:5559-66 (2010) 
 
Cytochrome P450 2D6
Name:Cytochrome P450 2D6
Type:Protein
Mol. Mass.:55774.82
Organism:Homo sapiens (Human)
Description:P10635
Residue:497
BDBM50325639
NameBDBM50325639
Synonyms:(3-(3,3-dimethylbutyl)pyrrolidin-3-yl)(quinolin-2-yl)methanone | CHEMBL1224239
TypeSmall organic molecule
Emp. Form.C20H26N2O
Mol. Mass.310.4332
SMILESCC(C)(C)CCC1(CCNC1)C(=O)c1ccc2ccccc2n1