Reaction Details
TargetCytochrome P450 1A1
LigandBDBM26667
Substrate/Competitorn/a
Meas. Tech.ChEMBL_652514 (CHEMBL1225717)
IC50 7906±n/a nM
Citation Takemura, HItoh, TYamamoto, KSakakibara, HShimoi, K Selective inhibition of methoxyflavonoids on human CYP1B1 activity. Bioorg Med Chem18:6310-5 (2010) 
 
Cytochrome P450 1A1
Name:Cytochrome P450 1A1
Type:Protein
Mol. Mass.:58177.23
Organism:Homo sapiens (Human)
Description:P04798
Residue:512
BDBM26667
NameBDBM26667
Synonyms:(2S)-5,7-dihydroxy-2-phenyl-3,4-dihydro-2H-1-benzopyran-4-one CHEMBL399910
TypeFlavonoid
Emp. Form.C15H12O4
Mol. Mass.256.2534
SMILESOc1cc(O)c2C(=O)C[C@H](Oc2c1)c1ccccc1