Reaction Details
TargetCytochrome P450 1A2
LigandBDBM23418
Substrate/Competitorn/a
Meas. Tech.ChEMBL_652513 (CHEMBL1225716)
IC50 34647±n/a nM
Citation Takemura, HItoh, TYamamoto, KSakakibara, HShimoi, K Selective inhibition of methoxyflavonoids on human CYP1B1 activity. Bioorg Med Chem18:6310-5 (2010) 
 
Cytochrome P450 1A2
Name:Cytochrome P450 1A2
Type:Enzyme
Mol. Mass.:58423.38
Organism:Homo sapiens (Human)
Description:P05177
Residue:516
BDBM23418
NameBDBM23418
Synonyms:(2S)-5,7-dihydroxy-2-(3-hydroxy-4-methoxyphenyl)-3,4-dihydro-2H-1-benzopyran-4-one Hesperitin
Typeflavanone
Emp. Form.C16H14O6
Mol. Mass.302.2788
SMILESCOc1ccc(cc1O)[C@@H]1CC(=O)c2c(O)cc(O)cc2O1