Reaction Details
TargetCytochrome P450 1A2
LigandBDBM50325671
Substrate/Competitorn/a
Meas. Tech.ChEMBL_652513 (CHEMBL1225716)
IC50 53214±n/a nM
Citation Takemura, HItoh, TYamamoto, KSakakibara, HShimoi, K Selective inhibition of methoxyflavonoids on human CYP1B1 activity. Bioorg Med Chem18:6310-5 (2010) 
 
Cytochrome P450 1A2
Name:Cytochrome P450 1A2
Type:Enzyme
Mol. Mass.:58423.38
Organism:Homo sapiens (Human)
Description:P05177
Residue:516
BDBM50325671
NameBDBM50325671
Synonyms:(2S)-2-(3,4-DIHYDROXYPHENYL)-5,7-DIHYDROXY-2,3-DIHYDRO-4H-CHROMEN-4-ONE (S)-2-(3,4-dihydroxyphenyl)-5,7-dihydroxy-2,3-dihydrochromen-4-one 5,7,3',4'-tetrahydroxyflavanone CHEMBL8996 eriodicryol hsp90_170
TypeSmall organic molecule
Emp. Form.C15H12O6
Mol. Mass.288.2522
SMILESOc1cc(O)c2C(=O)C[C@H](Oc2c1)c1ccc(O)c(O)c1