Reaction Details
TargetCytochrome P450 1A1
LigandBDBM50325673
Substrate/Competitorn/a
Meas. Tech.ChEMBL_652514 (CHEMBL1225717)
IC50 2196±n/a nM
Citation Takemura, HItoh, TYamamoto, KSakakibara, HShimoi, K Selective inhibition of methoxyflavonoids on human CYP1B1 activity. Bioorg Med Chem18:6310-5 (2010) 
 
Cytochrome P450 1A1
Name:Cytochrome P450 1A1
Type:Protein
Mol. Mass.:58177.23
Organism:Homo sapiens (Human)
Description:P04798
Residue:512
BDBM50325673
NameBDBM50325673
Synonyms:5,7-dihydroxy-4'-methoxyflavanone ISOSAKUTANETIN naringenin 4'-methyl ether
TypeSmall organic molecule
Emp. Form.C16H14O5
Mol. Mass.286.2794
SMILESCOc1ccc(cc1)[C@@H]1CC(=O)c2c(O)cc(O)cc2O1