Reaction Details
TargetCytochrome P450 1B1
LigandBDBM50325672
Substrate/Competitorn/a
Meas. Tech.ChEMBL_652515 (CHEMBL1225718)
IC50 1716±n/a nM
Citation Takemura, HItoh, TYamamoto, KSakakibara, HShimoi, K Selective inhibition of methoxyflavonoids on human CYP1B1 activity. Bioorg Med Chem18:6310-5 (2010) 
 
Cytochrome P450 1B1
Name:Cytochrome P450 1B1
Type:PROTEIN
Mol. Mass.:60861.81
Organism:Homo sapiens (Human)
Description:ChEMBL_1474523
Residue:543
BDBM50325672
NameBDBM50325672
Synonyms:5,7,4'-Trihydroxy-3'-methoxyflavanone HOMOERIODICTYOL
TypeSmall organic molecule
Emp. Form.C16H14O6
Mol. Mass.302.2788
SMILESCOc1cc(ccc1O)[C@@H]1CC(=O)c2c(O)cc(O)cc2O1