Reaction Details
TargetCytochrome P450 1A2
LigandBDBM50325674
Substrate/Competitorn/a
Meas. Tech.ChEMBL_652513 (CHEMBL1225716)
IC50 1215±n/a nM
Citation Takemura, HItoh, TYamamoto, KSakakibara, HShimoi, K Selective inhibition of methoxyflavonoids on human CYP1B1 activity. Bioorg Med Chem18:6310-5 (2010) 
 
Cytochrome P450 1A2
Name:Cytochrome P450 1A2
Type:Enzyme
Mol. Mass.:58423.38
Organism:Homo sapiens (Human)
Description:P05177
Residue:516
BDBM50325674
NameBDBM50325674
Synonyms:3,5,7-trihydroxy-2-(3-hydroxy-4-methoxyphenyl)-4H-chromen-4-one Tamarixetin (22) | tamarixetin
TypeSmall organic molecule
Emp. Form.C16H12O7
Mol. Mass.316.2623
SMILESCOc1ccc(cc1O)-c1oc2cc(O)cc(O)c2c(=O)c1O