Reaction Details
TargetCytochrome P450 1A2
LigandBDBM50084978
Substrate/Competitorn/a
Meas. Tech.ChEMBL_652513 (CHEMBL1225716)
IC50 509±n/a nM
Citation Takemura, HItoh, TYamamoto, KSakakibara, HShimoi, K Selective inhibition of methoxyflavonoids on human CYP1B1 activity. Bioorg Med Chem18:6310-5 (2010) 
 
Cytochrome P450 1A2
Name:Cytochrome P450 1A2
Type:Enzyme
Mol. Mass.:58423.38
Organism:Homo sapiens (Human)
Description:P05177
Residue:516
BDBM50084978
NameBDBM50084978
Synonyms:3,5,7-trihydroxy-2-(4-methoxyphenyl)-4H-chromen-4-one Kaempferide | Kaempferol 4'-methyl ether
TypeSmall organic molecule
Emp. Form.C16H12O6
Mol. Mass.300.2629
SMILESCOc1ccc(cc1)-c1oc2cc(O)cc(O)c2c(=O)c1O