Reaction Details
TargetCytochrome P450 1A2
LigandBDBM23415
Substrate/Competitorn/a
Meas. Tech.ChEMBL_652513 (CHEMBL1225716)
IC50 251±n/a nM
Citation Takemura, HItoh, TYamamoto, KSakakibara, HShimoi, K Selective inhibition of methoxyflavonoids on human CYP1B1 activity. Bioorg Med Chem18:6310-5 (2010) 
 
Cytochrome P450 1A2
Name:Cytochrome P450 1A2
Type:Enzyme
Mol. Mass.:58423.38
Organism:Homo sapiens (Human)
Description:P05177
Residue:516
BDBM23415
NameBDBM23415
Synonyms:5,7-dihydroxy-2-(4-methoxyphenyl)-4H-chromen-4-one CHEMBL243664
Typeflavone
Emp. Form.C16H12O5
Mol. Mass.284.2635
SMILESCOc1ccc(cc1)-c1cc(=O)c2c(O)cc(O)cc2o1