Reaction Details
TargetCytochrome P450 1A1
LigandBDBM50049391
Substrate/Competitorn/a
Meas. Tech.ChEMBL_652514 (CHEMBL1225717)
IC50 77±n/a nM
Citation Takemura, HItoh, TYamamoto, KSakakibara, HShimoi, K Selective inhibition of methoxyflavonoids on human CYP1B1 activity. Bioorg Med Chem18:6310-5 (2010) 
 
Cytochrome P450 1A1
Name:Cytochrome P450 1A1
Type:Protein
Mol. Mass.:58177.23
Organism:Homo sapiens (Human)
Description:P04798
Residue:512
BDBM50049391
NameBDBM50049391
Synonyms:3,5,7-Trihydroxyflavone 3,5,7-trihydroxy-2-phenyl-4H-benzopyran-4-one CHEMBL309490 Galangin (15) cid_5281616 | norizalpinin
TypeSmall organic molecule
Emp. Form.C15H10O5
Mol. Mass.270.2369
SMILESOc1cc(O)c2c(c1)oc(-c1ccccc1)c(O)c2=O