Reaction Details
TargetCytochrome P450 1B1
LigandBDBM50084978
Substrate/Competitorn/a
Meas. Tech.ChEMBL_652515 (CHEMBL1225718)
IC50 25±n/a nM
Citation Takemura, HItoh, TYamamoto, KSakakibara, HShimoi, K Selective inhibition of methoxyflavonoids on human CYP1B1 activity. Bioorg Med Chem18:6310-5 (2010) 
 
Cytochrome P450 1B1
Name:Cytochrome P450 1B1
Type:PROTEIN
Mol. Mass.:60861.81
Organism:Homo sapiens (Human)
Description:ChEMBL_1474523
Residue:543
BDBM50084978
NameBDBM50084978
Synonyms:3,5,7-trihydroxy-2-(4-methoxyphenyl)-4H-chromen-4-one Kaempferide | Kaempferol 4'-methyl ether
TypeSmall organic molecule
Emp. Form.C16H12O6
Mol. Mass.300.2629
SMILESCOc1ccc(cc1)-c1oc2cc(O)cc(O)c2c(=O)c1O